Compilation error for SForce Extension

Compilation error for SForce Extension

  

I had trouble with the most recent build of the SalesForce connector - it would appear the .NET stuff compiles just fine, but there are a couple "throws" declarations missing from the getSalesforceNamesFromOutSystemsRecord(...) method declaration. Fixing the compilation error was a simple matter of adding those exceptions to the throws clause of the declaration, although I have no idea if there are other problems stemming from those exceptions not being there before. This is the compilation output: 

J2EE Compilation.

Buildfile: C:\Users\N060360\AppData\Local\Temp\510d2126-24b6-484c-9521-75dec0ae8b2a\Source\J2EE\build.xml

init:

compile:

   [mkdir] Created dir: C:\Users\N060360\AppData\Local\Temp\510d2126-24b6-484c-9521-75dec0ae8b2a\Source\J2EE\bin

   [javac] C:\Users\N060360\AppData\Local\Temp\510d2126-24b6-484c-9521-75dec0ae8b2a\Source\J2EE\build.xml:34: warning: 'includeantruntime' was not set, defaulting to build.sysclasspath=last; set to false for repeatable builds

   [javac] Compiling 49 source files to C:\Users\N060360\AppData\Local\Temp\510d2126-24b6-484c-9521-75dec0ae8b2a\Source\J2EE\bin

   [javac] C:\Users\N060360\AppData\Local\Temp\510d2126-24b6-484c-9521-75dec0ae8b2a\Source\J2EE\outsystems\nossforce\ObjectMapping.java:248: error: unreported exception InvalidSObjectFault_Exception; must be caught or declared to be thrown

   [javac]         if (sessionInfo.getTypeInfo(className) == null) {

   [javac]                                    ^

   [javac] C:\Users\N060360\AppData\Local\Temp\510d2126-24b6-484c-9521-75dec0ae8b2a\Source\J2EE\outsystems\nossforce\ObjectMapping.java:264: error: unreported exception InvalidSObjectFault_Exception; must be caught or declared to be thrown

   [javac]             outsystems.salesforce.connector.Field sForceField = sessionInfo.getField(className, sForceFieldName) ;

   [javac]                                                                                     ^

   [javac] 2 errors

BUILD FAILED

C:\Users\N060360\AppData\Local\Temp\510d2126-24b6-484c-9521-75dec0ae8b2a\Source\J2EE\build.xml:34: Compile failed; see the compiler error output for details.

Total time: 2 seconds