7
Views
1
Comments
Error in generating IOS app in Mobile
Question

Hello outsystems team, 

I always got zero byte in IPA file so I regenerate again but I encountered a strange errors.


[2020-11-11T22:17:45.410Z] [VERBOSE] [Build] 

[2020-11-11T22:17:45.410Z] [VERBOSE] [Build] You have been opted out of telemetry. To change this, run: cordova telemetry on.

[2020-11-11T22:17:45.410Z] [VERBOSE] [Build] Using detached cordova-create

[2020-11-11T22:17:45.410Z] [VERBOSE] [Build] Creating a new cordova project.

[2020-11-11T22:17:45.410Z] [VERBOSE] [Build] Copying assets."

[2020-11-11T22:17:45.410Z] [VERBOSE] [Build] Using cordova-fetch for https://*@github.com/OutSystems/private-NativeShell-Template.git#8.4.4

[2020-11-11T22:17:45.410Z] [VERBOSE] [Build] Running command: npm install https://*@github.com/OutSystems/private-NativeShell-Template.git#8.4.4 --production --no-save

[2020-11-11T22:17:45.410Z] [VERBOSE] [Build] Command finished with error code 1: npm install,https://*@github.com/OutSystems/private-NativeShell-Template.git#8.4.4,--production,--no-save

[2020-11-11T22:17:45.410Z] [VERBOSE] [Build] Error: Unhandled error. ('\u001b[1m \u001b[31m Error from Cordova Fetch: Error: npm: Command failed with exit code 1 Error output:\n' +

[2020-11-11T22:17:45.410Z] [VERBOSE] [Build]   'npm ERR! Error while executing:\n' +

[2020-11-11T22:17:45.410Z] [VERBOSE] [Build]   'npm ERR! /usr/bin/git ls-remote -h -t https://*@github.com/OutSystems/private-NativeShell-Template.git\n' +

[2020-11-11T22:17:45.410Z] [VERBOSE] [Build]   'npm ERR! \n' +

[2020-11-11T22:17:45.410Z] [VERBOSE] [Build]   'npm ERR! remote: Repository not found.\n' +

[2020-11-11T22:17:45.410Z] [VERBOSE] [Build]   "npm ERR! fatal: repository 'https://*@github.com/OutSystems/private-NativeShell-Template.git/' not found\n" +

[2020-11-11T22:17:45.410Z] [VERBOSE] [Build]   'npm ERR! \n' +

[2020-11-11T22:17:45.410Z] [VERBOSE] [Build]   'npm ERR! exited with error code: 128\n' +

[2020-11-11T22:17:45.410Z] [VERBOSE] [Build]   '\n' +

[2020-11-11T22:17:45.410Z] [VERBOSE] [Build]   'npm ERR! A complete log of this run can be found in:\n' +

[2020-11-11T22:17:45.410Z] [VERBOSE] [Build]   'npm ERR!     .npm/_logs/2020-11-11T22_17_45_375Z-debug.log')

[2020-11-11T22:17:45.417Z] [ERROR] [Build] Error: Unhandled error. ('\u001b[1m \u001b[31m Error from Cordova Fetch: Error: npm: Command failed with exit code 1 Error output:\n' +

[2020-11-11T22:17:45.417Z] [ERROR] [Build]   'npm ERR! Error while executing:\n' +

[2020-11-11T22:17:45.417Z] [ERROR] [Build]   'npm ERR! /usr/bin/git ls-remote -h -t https://*@github.com/OutSystems/private-NativeShell-Template.git\n' +

[2020-11-11T22:17:45.417Z] [ERROR] [Build]   'npm ERR! \n' +

[2020-11-11T22:17:45.417Z] [ERROR] [Build]   'npm ERR! remote: Repository not found.\n' +

[2020-11-11T22:17:45.417Z] [ERROR] [Build]   "npm ERR! fatal: repository 'https://*@github.com/OutSystems/private-NativeShell-Template.git/' not found\n" +

[2020-11-11T22:17:45.417Z] [ERROR] [Build]   'npm ERR! \n' +

[2020-11-11T22:17:45.417Z] [ERROR] [Build]   'npm ERR! exited with error code: 128\n' +

[2020-11-11T22:17:45.417Z] [ERROR] [Build]   '\n' +

[2020-11-11T22:17:45.417Z] [ERROR] [Build]   'npm ERR! A complete log of this run can be found in:\n' +

[2020-11-11T22:17:45.417Z] [ERROR] [Build]   'npm ERR!     .npm/_logs/2020-11-11T22_17_45_375Z-debug.log')

[2020-11-11T22:17:45.417Z] [ERROR] [Build] Build failed with the following error: An unexpected error has occurred while initializing your application. Please try again. If the problem persists, contact OutSystems Support.

[2020-11-11T22:17:45.418Z] [INFO] [Build] Zipping application source...

[2020-11-11T22:17:45.418Z] [ERROR] [Build] Unable to zip your application source code!

BBQAppiOSBuildLog1.txt

Rank: #2422

Hi Joseph Omas, the error happen because the repository doesn't exist in Github. So that you can't generate the ios app.