[Image Editor Plugin] Plugin Not Compatible with MABS 7.1, Please Help.
Forge component by André Gonçalves
Application Type
Mobile

Dear Image Editor Plugin Team,

I trying to generate the App for IOS with MABS 7.1 , but our get a error, error message about for Image Editor Plugin.

Could you please help to fix it? 


That's error message:

[2021-10-12T07:04:27.593Z] [VERBOSE] [Build] import OSPhotoEditor

[2021-10-12T07:04:27.593Z] [VERBOSE] [Build] ^

[2021-10-12T07:04:27.699Z] [VERBOSE] [Build] warning: The iOS deployment target 'IPHONEOS_DEPLOYMENT_TARGET' is set to 8.0, but the range of supported deployment target versions is 9.0 to 14.2.99. (in target 'FLEX' from project 'Pods')

[2021-10-12T07:04:27.701Z] [VERBOSE] [Build] warning: The iOS deployment target 'IPHONEOS_DEPLOYMENT_TARGET' is set to 6.0, but the range of supported deployment target versions is 9.0 to 14.2.99. (in target 'YapDatabase' from project 'Pods')

[2021-10-12T07:04:27.701Z] [VERBOSE] [Build] warning: The iOS deployment target 'IPHONEOS_DEPLOYMENT_TARGET' is set to 7.0, but the range of supported deployment target versions is 9.0 to 14.2.99. (in target 'PureeOS' from project 'Pods')

[2021-10-12T07:04:27.725Z] [VERBOSE] [Build] ** ARCHIVE FAILED **

[2021-10-12T07:04:27.725Z] [VERBOSE] [Build] The following build commands failed:

[2021-10-12T07:04:27.726Z] [VERBOSE] [Build] CompileSwift normal arm64 source/platforms/ios/E-Patrolling/Plugins/com.outsystems.imageeditorplugin/ImageEditorPlugin.swift

[2021-10-12T07:04:27.726Z] [VERBOSE] [Build] CompileSwiftSources normal arm64 com.apple.xcode.tools.swift.compiler

[2021-10-12T07:04:27.726Z] [VERBOSE] [Build] (2 failures)

[2021-10-12T07:04:27.737Z] [VERBOSE] [Build] Command finished with error code 65: xcodebuild -workspace,E-Patrolling.xcworkspace,-scheme,E-Patrolling,-configuration,Debug,-destination,generic/platform=iOS,-archivePath,E-Patrolling.xcarchive,archive,CONFIGURATION_BUILD_DIR=source/platforms/ios/build/device,SHARED_PRECOMPS_DIR=source/platforms/ios/build/sharedpch,OTHER_CODE_SIGN_FLAGS=--options runtime

[2021-10-12T07:04:27.738Z] [VERBOSE] [Build] xcodebuild: Command failed with exit code 65

[2021-10-12T07:04:27.738Z] [VERBOSE] [Build] Error: xcodebuild: Command failed with exit code 65

[2021-10-12T07:04:27.739Z] [VERBOSE] [Build] at ChildProcess.whenDone (source/node_modules/cordova-common/src/superspawn.js:136:25)

[2021-10-12T07:04:27.739Z] [VERBOSE] [Build] at ChildProcess.emit (events.js:314:20)

[2021-10-12T07:04:27.739Z] [VERBOSE] [Build] at maybeClose (internal/child_process.js:1022:16)

[2021-10-12T07:04:27.739Z] [VERBOSE] [Build] at Process.ChildProcess._handle.onexit (internal/child_process.js:287:5)

[2021-10-12T07:04:27.883Z] [VERBOSE] [Build] Setting default keychain...

[2021-10-12T07:04:27.883Z] [VERBOSE] [Build] Deleting temporary keychain...

[2021-10-12T07:04:27.883Z] [VERBOSE] [Build] Deleting provision profile...

[2021-10-12T07:04:27.883Z] [VERBOSE] [Build] /Users/sandbox03/Library/MobileDevice/Provisioning Profiles//4cd78ffb-cabb-46f2-85f6-4d927e7e3fa9.mobileprovision

[2021-10-12T07:04:27.888Z] [ERROR] [Build] ** ARCHIVE FAILED **

[2021-10-12T07:04:27.888Z] [ERROR] [Build] The following build commands failed:

[2021-10-12T07:04:27.888Z] [ERROR] [Build] CompileSwift normal arm64 source/platforms/ios/E-Patrolling/Plugins/com.outsystems.imageeditorplugin/ImageEditorPlugin.swift

[2021-10-12T07:04:27.888Z] [ERROR] [Build] CompileSwiftSources normal arm64 com.apple.xcode.tools.swift.compiler

[2021-10-12T07:04:27.888Z] [ERROR] [Build] (2 failures)

[2021-10-12T07:04:27.888Z] [ERROR] [Build] xcodebuild: Command failed with exit code 65


[2021-10-12T07:04:27.888Z] [ERROR] [Build] Build failed with the following error: Something happened on our side while generating your app. Please try again.


Thank you

Best Regards

Mars



Community GuidelinesBe kind and respectful, give credit to the original source of content, and search for duplicates before posting.