Integration Studio BUILD FAILED

Integration Studio BUILD FAILED

  
Hello guys

I'm trying creating an action by Integration Studio for a simple funcionality with one Input and one Output variables.

The problem occur when I try to compile the action.

BUILD FAILED
Target "C:\Java\jdk1.6.0_45\bin" does not exist in the project "ConvertObjectToXml"
 
Someone know what is the problem?

The action is in Java language.

Thanks a lot
Hi Tiago,

Can you see if you have everything according to this thread: http://www.outsystems.com/forums/discussion/9519/how-to-configure-integration-studio-to-work-with-net-and-java-j2ee-extensions/?

Let us know if you continue to experience problems after reviewing your configurations.

Best regards,

Tito Azevedo
Thanks very much Tito.

I could solve the issue with the information on this link

Tito Azevedo wrote:
Hi Tiago,

Can you see if you have everything according to this thread: http://www.outsystems.com/forums/discussion/9519/how-to-configure-integration-studio-to-work-with-net-and-java-j2ee-extensions/?

Let us know if you continue to experience problems after reviewing your configurations.

Best regards,

Tito Azevedo